llvm archive · February 2023
739 messages · showing the 100 most-recently-active threads .
-
STALE1310d
REVIEWED: 5 (5M) [PATCH v3] MIPS: Workaround clang inline compat branch issue
2023-02-28 22:19 · 2 replies this month · Jiaxun Yang <jiaxun.yang@flygoat.com> -
DORMANTno replies
❌ FAIL (0/5 SKIPPED): Test report for master (6.2.0, mainline.kernel.org-clang, e492250d)
2023-02-28 19:31 · 0 replies this month · <hidden> -
STALE1311d
[PATCH v2] MIPS: Workaround clang inline compat branch issue
2023-02-28 19:29 · 2 replies this month · Jiaxun Yang <jiaxun.yang@flygoat.com> -
STALE1302d
Re: [PATCH v1 2/2] mm: vmscan: ignore non-LRU-based reclaim in memcg reclaim
2023-02-28 17:25 · 2 replies this month · kernel test robot <hidden> -
DORMANTno replies
include/linux/fortify-string.h:520:4: warning: call to '__write_overflow_field' declared with 'warning' attribute: detected write beyond size of field (1st parameter); maybe use struct_group()?
2023-02-28 16:56 · 0 replies this month · kernel test robot <hidden> -
STALE1304d
Re: [PATCH 03/10] drm/i915/dsc: move DSC tables to DRM DSC helper
2023-02-28 15:18 · 0 replies this month · kernel test robot <hidden> -
DORMANTno replies
[syzbot] [ntfs3?] UBSAN: shift-out-of-bounds in ntfs_fill_super (2)
2023-02-28 14:19 · 0 replies this month · syzbot <hidden> -
STALE1311d
[PATCH] drm: omapdrm: Do not use helper unininitialized in omap_fbdev_init()
2023-02-28 09:14 · 3 replies this month · Nathan Chancellor <nathan@kernel.org> -
DORMANTno replies
A new contract document has been shared with you
2023-02-28 08:29 · 0 replies this month · Projects team <hidden> -
STALE1311d
Re: [PATCH] sched: delete some api is not used
2023-02-28 07:35 · 0 replies this month · kernel test robot <hidden> -
DORMANTno replies
❌ FAIL (0/5 SKIPPED): Test report for master (6.2.0, mainline.kernel.org-clang, ae3419fb)
2023-02-28 04:20 · 0 replies this month · <hidden> -
DORMANTno replies
drivers/iommu/fsl_pamu.c:586: warning: This comment starts with '/**', but isn't a kernel-doc comment. Refer Documentation/doc-guide/kernel-doc.rst
2023-02-28 03:37 · 0 replies this month · kernel test robot <hidden> -
DORMANTno replies
❌ FAIL (0/5 SKIPPED): Test report for master (6.2.0, mainline.kernel.org-clang, 981ee95c)
2023-02-28 02:30 · 0 replies this month · <hidden> -
DORMANTno replies
❌ FAIL (0/5 SKIPPED): Test report for master (6.2.0, mainline.kernel.org-clang, 10383068)
2023-02-28 01:40 · 0 replies this month · <hidden> -
DORMANTno replies
[stable:linux-5.15.y 9895/9999] drivers/gpu/drm/amd/amdgpu/../display/amdgpu_dm/amdgpu_dm.c:4433:14: warning: performing pointer subtraction with a null pointer has undefined behavior
2023-02-28 01:14 · 0 replies this month · kernel test robot <hidden> -
DORMANTno replies
❌ FAIL (0/5 SKIPPED): Test report for master (6.2.0, mainline.kernel.org-clang, 32ff6831)
2023-02-28 00:10 · 0 replies this month · <hidden> -
DORMANTno replies
drivers/clk/.kunitconfig: warning: ignored by one of the .gitignore files
2023-02-27 23:52 · 0 replies this month · kernel test robot <hidden> -
DORMANTno replies
❌ FAIL (0/5 SKIPPED): Test report for master (6.2.0, mainline.kernel.org-clang, 5ca26d60)
2023-02-27 23:30 · 0 replies this month · <hidden> -
DORMANTno replies
[intel-tdx:kvm-upstream-workaround 435/440] include/linux/kvm_host.h:429:2: error: call to undeclared function 'perf_event_guest_enter_exit'; ISO C99 and later do not support implicit function declarations
2023-02-27 22:51 · 0 replies this month · kernel test robot <hidden> -
DORMANTno replies
❌ FAIL (0/5 SKIPPED): Test report for master (6.2.0, mainline.kernel.org-clang, 98281842)
2023-02-27 19:30 · 0 replies this month · <hidden> -
STALE1312d
[PATCH] MIPS: Workaround clang inline compat branch issue
2023-02-27 18:19 · 1 reply this month · Jiaxun Yang <jiaxun.yang@flygoat.com> -
STALE1301d
Re: [PATCH v4 2/2] vdpasim: support doorbell mapping
2023-02-27 15:48 · 0 replies this month · kernel test robot <hidden> -
STALE1312d
Re: [Intel-gfx] [PATCH] drm/tests: Suballocator test
2023-02-27 14:19 · 0 replies this month · kernel test robot <hidden> -
STALE1312d
Re: [PATCH v7 1/1] riscv: Allow to downgrade paging mode from the command line
2023-02-27 13:43 · 3 replies this month · Conor Dooley <conor.dooley@microchip.com> -
DORMANTno replies
Re: [Intel-gfx] [PATCH] drm/i915/display: Communicate display power demands to pcode more accurately
2023-02-27 12:52 · 0 replies this month · kernel test robot <hidden> -
STALE1311d
Re: [PATCH] amdgpu: add a filter condition when set brightness
2023-02-27 12:18 · 0 replies this month · kernel test robot <hidden> -
DORMANTno replies
[intel-tdx:kvm-upstream-workaround 435/440] include/linux/mman.h:154:9: warning: division by zero is undefined
2023-02-27 11:16 · 0 replies this month · kernel test robot <hidden> -
STALE1312d
Re: [PATCH v11 05/10] drm/shmem-helper: Add memory shrinker
2023-02-27 11:05 · 1 reply this month · kernel test robot <hidden> -
DORMANTno replies
vmlinux.o: warning: objtool: ct_idle_exit+0x4c: call to ftrace_likely_update() leaves .noinstr.text section
2023-02-27 06:23 · 0 replies this month · kernel test robot <hidden> -
DORMANTno replies
LANDED [ammarfaizi2-block:akpm/mm/mm-unstable 13/64] ld.lld: error: undefined symbol: memcpy
2023-02-27 06:03 · 0 replies this month · kernel test robot <hidden> -
DORMANTno replies
next/master build: 195 builds: 10 failed, 185 passed, 14 errors, 16 warnings (next-20230227)
2023-02-27 02:28 · 0 replies this month · kernelci.org bot <hidden> -
DORMANTno replies
[jsarha:topic/cros-sof-v4.14-rebase 9406/9999] drivers/media/dvb-frontends/mxl5xx.o: warning: objtool: convert_endian()+0x5b: can't find switch jump table
2023-02-27 02:08 · 0 replies this month · kernel test robot <hidden> -
DORMANTno replies
❌ FAIL (0/5 SKIPPED): Test report for master (6.2.0, mainline.kernel.org-clang, f3a2439f)
2023-02-27 01:31 · 0 replies this month · <hidden> -
STALE1174d
Re: [PATCH] hwspinlock: add a check of devm_regmap_field_alloc in qcom_hwspinlock_probe
2023-02-27 00:41 · 1 reply this month · kernel test robot <hidden> -
DORMANTno replies
include/linux/gpio/driver.h:31:19: error: field has incomplete type 'msi_alloc_info_t' (aka 'struct irq_alloc_info')
2023-02-26 22:50 · 0 replies this month · kernel test robot <hidden> -
DORMANTno replies
drivers/block/drbd/drbd_bitmap.c:451:7: warning: expression result unused
2023-02-26 22:10 · 0 replies this month · kernel test robot <hidden> -
DORMANTno replies
arch/arm/mach-versatile/versatile.c:56:14: warning: no previous prototype for function 'mmc_status'
2023-02-26 20:37 · 0 replies this month · kernel test robot <hidden> -
DORMANTno replies
[stable:linux-5.10.y 3758/9999] drivers/md/bcache/sysfs.o: warning: objtool: bch_cache_show() falls through to next function bch_cache_store()
2023-02-26 20:27 · 0 replies this month · kernel test robot <hidden> -
DORMANTno replies
drivers/gpio/gpio-mxc.c:341:50: warning: shift count >= width of type
2023-02-26 19:05 · 0 replies this month · kernel test robot <hidden> -
DORMANTno replies
❌ FAIL (100/381 SKIPPED): Test report for master (6.2.0, mainline.kernel.org-clang, 2fcd07b7)
2023-02-26 19:01 · 0 replies this month · <hidden> -
DORMANTno replies
[peterz-queue:locking/core 6/7] kernel/locking/rwsem.c:1037:2: error: use of undeclared identifier 'LOCKEVENT_rwem_rlock_fail'; did you mean 'LOCKEVENT_rwsem_rlock_fail'?
2023-02-26 18:34 · 0 replies this month · kernel test robot <hidden> -
STALE1313d
[PATCH AUTOSEL 5.15 18/36] crypto: hisilicon: Wipe entire pool on error
2023-02-26 15:06 · 0 replies this month · Sasha Levin <sashal@kernel.org> -
STALE1313d
[PATCH AUTOSEL 5.10 16/27] crypto: hisilicon: Wipe entire pool on error
2023-02-26 14:56 · 0 replies this month · Sasha Levin <sashal@kernel.org> -
STALE1313d
[PATCH AUTOSEL 6.1 23/49] crypto: hisilicon: Wipe entire pool on error
2023-02-26 14:50 · 0 replies this month · Sasha Levin <sashal@kernel.org> -
STALE1313d
REVIEWED: 1 (0M) [PATCH AUTOSEL 6.1 13/49] bpftool: Always disable stack protection for BPF objects
2023-02-26 14:49 · 0 replies this month · Sasha Levin <sashal@kernel.org> -
STALE1310d
[PATCH AUTOSEL 6.2 25/53] crypto: hisilicon: Wipe entire pool on error
2023-02-26 14:47 · 0 replies this month · Sasha Levin <sashal@kernel.org> -
STALE1310d
[PATCH AUTOSEL 6.2 20/53] Compiler attributes: GCC cold function alignment workarounds
2023-02-26 14:47 · 0 replies this month · Sasha Levin <sashal@kernel.org> -
STALE1310d
REVIEWED: 1 (0M) [PATCH AUTOSEL 6.2 13/53] bpftool: Always disable stack protection for BPF objects
2023-02-26 14:47 · 0 replies this month · Sasha Levin <sashal@kernel.org> -
DORMANTno replies
❌ FAIL (114/381 SKIPPED): Test report for master (6.2.0, mainline.kernel.org-clang, 116b4116)
2023-02-26 13:31 · 0 replies this month · <hidden> -
DORMANTno replies
❌ FAIL (96/381 SKIPPED): Test report for master (6.2.0, mainline.kernel.org-clang, 1ec35ead)
2023-02-26 12:41 · 0 replies this month · <hidden> -
DORMANTno replies
❌ FAIL (96/381 SKIPPED): Test report for master (6.2.0, mainline.kernel.org-clang, cac85e46)
2023-02-26 12:01 · 0 replies this month · <hidden> -
DORMANTno replies
Re: [PATCH v12 bpf-next 09/10] bpf: Add bpf_dynptr_slice and bpf_dynptr_slice_rdwr
2023-02-26 10:56 · 0 replies this month · kernel test robot <hidden> -
DORMANTno replies
❌ FAIL (103/381 SKIPPED): Test report for master (6.2.0, mainline.kernel.org-clang, 7c3dc440)
2023-02-26 10:41 · 0 replies this month · <hidden> -
STALE1313d
Re: [PATCH v12 bpf-next 09/10] bpf: Add bpf_dynptr_slice and bpf_dynptr_slice_rdwr
2023-02-26 10:15 · 0 replies this month · kernel test robot <hidden> -
STALE1313d
Re: [PATCH v12 bpf-next 09/10] bpf: Add bpf_dynptr_slice and bpf_dynptr_slice_rdwr
2023-02-26 10:04 · 0 replies this month · kernel test robot <hidden> -
STALE1307d
Re: [PATCH v8 1/3] KVM: Implement dirty quota-based throttling of vcpus
2023-02-25 22:28 · 0 replies this month · kernel test robot <hidden> -
STALE1287d
Re: [PATCH INTERNAL v1 2/3] pinctrl: tps6594: add for TPS6594 PMIC
2023-02-25 20:37 · 0 replies this month · kernel test robot <hidden> -
DORMANTno replies
ld.lld: error: vmlinux.a(init/main.o):(function __traceiter_initcall_level: .text+0x24): relocation R_RISCV_HI20 out of range: 532254 is not in [-524288, 524287]; references __tracepoint_initcall_level
2023-02-25 20:16 · 0 replies this month · kernel test robot <hidden> -
DORMANTno replies
❌ FAIL (105/381 SKIPPED): Test report for master (6.2.0, mainline.kernel.org-clang, 489fa31e)
2023-02-25 17:41 · 0 replies this month · <hidden> -
STALE1312d
Re: [PATCH] ARM64: dts: debix model-a: enable hdmi
2023-02-25 15:41 · 0 replies this month · kernel test robot <hidden> -
DORMANTno replies
drivers/net/ethernet/mediatek/mtk_eth_soc.c:1481:23: warning: result of comparison of constant 65536 with expression of type 'u16' (aka 'unsigned short') is always true
2023-02-25 14:29 · 0 replies this month · kernel test robot <hidden> -
DORMANTno replies
arch/arm/mm/copypage-xsc3.c:64:6: warning: no previous prototype for function 'xsc3_mc_copy_user_highpage'
2023-02-25 14:29 · 0 replies this month · kernel test robot <hidden> -
DORMANTno replies
❌ FAIL (104/381 SKIPPED): Test report for master (6.2.0, mainline.kernel.org-clang, 595fa4e3)
2023-02-25 14:01 · 0 replies this month · <hidden> -
DORMANTno replies
❌ FAIL (110/381 SKIPPED): Test report for master (6.2.0, mainline.kernel.org-clang, 8cbd9233)
2023-02-25 12:10 · 0 replies this month · <hidden> -
DORMANTno replies
❌ FAIL (104/381 SKIPPED): Test report for master (6.2.0, mainline.kernel.org-clang, a93e884e)
2023-02-25 11:41 · 0 replies this month · <hidden> -
DORMANTno replies
Re: [PATCH 3/4] ACPI: EC: Make query handlers private
2023-02-25 11:04 · 0 replies this month · kernel test robot <hidden> -
STALE1314d
Re: [PATCH 3/4] ACPI: EC: Make query handlers private
2023-02-25 10:53 · 0 replies this month · kernel test robot <hidden> -
STALE1314d
Re: [PATCH] x86: profiling: Set prof_cpu_mask to NULL after free
2023-02-25 09:43 · 1 reply this month · kernel test robot <hidden> -
DORMANTno replies
[intel-tdx:kvm-upstream-workaround 96/371] usr/include/asm/kvm.h:599:22: warning: field 'cpuid' with variable sized type 'struct kvm_cpuid2' not at the end of a struct or class is a GNU extension
2023-02-25 09:00 · 0 replies this month · kernel test robot <hidden> -
STALE1304d
[RFC 0/2] RISC-V: enable rust
2023-02-25 08:37 · 9 replies this month · Conor Dooley <conor.dooley@microchip.com> -
STALE1314d
[ammarfaizi2-block:af/dev.btrfs 10/11] fs/btrfs/super.c:352:19: error: array type 'cpumask_var_t' (aka 'struct cpumask[1]') is not assignable
2023-02-25 08:27 · 1 reply this month · kernel test robot <hidden> -
DORMANTno replies
[ammarfaizi2-block:paulmck/linux-rcu/dev.2023.02.22a 85/86] arch/powerpc/kernel/smp.c:1768:1: error: function declared 'noreturn' should not return
2023-02-25 07:26 · 0 replies this month · kernel test robot <hidden> -
DORMANTno replies
[intel-tdx:tdx-mig-wip 104/625] drivers/firmware/efi/libstub/x86-stub.c:790:14: warning: implicit declaration of function 'efi_is_64bit' is invalid in C99
2023-02-25 07:24 · 0 replies this month · kernel test robot <hidden> -
DORMANTno replies
drivers/pinctrl/cirrus/pinctrl-lochnagar.c:200:1: error: call to undeclared function 'LOCHNAGAR1_'; ISO C99 and later do not support implicit function declarations
2023-02-25 07:12 · 0 replies this month · kernel test robot <hidden> -
DORMANTno replies
[intel-tdx:kvm-upstream 68/190] <stdin>:1565:2: warning: syscall memfd_restricted not implemented
2023-02-25 05:50 · 0 replies this month · kernel test robot <hidden> -
DORMANTno replies
next/master build: 183 builds: 7 failed, 176 passed, 10 errors, 18 warnings (next-20230225)
2023-02-25 05:45 · 0 replies this month · kernelci.org bot <hidden> -
DORMANTno replies
arch/arm/mm/copypage-fa.c:38:6: warning: no previous prototype for function 'fa_copy_user_highpage'
2023-02-25 05:14 · 0 replies this month · kernel test robot <hidden> -
DORMANTno replies
[stable:linux-5.17.y 1413/3797] drivers/gpu/drm/amd/amdgpu/../display/dc/core/dc.c:3758: warning: expecting prototype for dc_process_dmub_aux_transfer_async(). Prototype was for dc_enable_dmub_notifications() instead
2023-02-25 04:28 · 0 replies this month · kernel test robot <hidden> -
STALE1296d
Re: [PATCH -next v14 19/19] riscv: Enable Vector code to be built
2023-02-25 01:34 · 0 replies this month · kernel test robot <hidden> -
DORMANTno replies
[jfern:rcu/rcutop 1/1] kernel/rcu/tree.c:2783:1: warning: no previous prototype for function '__call_rcu_common'
2023-02-24 22:48 · 0 replies this month · kernel test robot <hidden> -
STALE1303d
[PATCH v6 02/12] kbuild: deb-pkg: create source package without cleaning
2023-02-24 22:34 · 1 reply this month · Masahiro Yamada <masahiroy@kernel.org> -
DORMANTno replies
[jfern:rcu/rcutop 1/1] kernel/rcu/debug.h:162:5: warning: no previous prototype for function 'rcu_debug_ptr_queue'
2023-02-24 22:27 · 0 replies this month · kernel test robot <hidden> -
DORMANTno replies
[jfern:rcu/rcutop 1/1] kernel/rcu/debug.h:162:5: warning: no previous prototype for function 'rcu_debug_ptr_queue'
2023-02-24 22:06 · 0 replies this month · kernel test robot <hidden> -
DORMANTno replies
[arm-integrator:kernel-in-vmalloc-v6.2-rc3-just-ttbr0-split 30/30] ipc/sem.c:1651:13: warning: stack frame size (1176) exceeds limit (1024) in 'ksys_semctl'
2023-02-24 21:56 · 0 replies this month · kernel test robot <hidden> -
STALE1296d
Re: [PATCH -next v14 19/19] riscv: Enable Vector code to be built
2023-02-24 21:35 · 0 replies this month · kernel test robot <hidden> -
DORMANTno replies
❌ FAIL (104/381 SKIPPED): Test report for master (6.2.0, mainline.kernel.org-clang, 3822a7c4)
2023-02-24 21:32 · 0 replies this month · <hidden> -
DORMANTno replies
❌ FAIL (107/381 SKIPPED): Test report for master (6.2.0, mainline.kernel.org-clang, d2980d8d)
2023-02-24 21:31 · 0 replies this month · <hidden> -
STALE1315d
[RFC RESEND 0/2] RISC-V: enable rust
2023-02-24 21:03 · 6 replies this month · Conor Dooley <conor.dooley@microchip.com> -
DORMANTno replies
[arm-integrator:kernel-in-vmalloc-v6.2-rc3-just-ttbr0-split 29/30] arch/arm/kernel/entry-armv.S:271:23: error: cannot mix positional and keyword arguments
2023-02-24 19:52 · 0 replies this month · kernel test robot <hidden> -
DORMANTno replies
[arm-integrator:kernel-in-vmalloc-v6.2-rc3-just-ttbr0-split 28/30] fs/binfmt_elf.c:1397:47: error: no member named 'name' in 'struct file'
2023-02-24 19:41 · 0 replies this month · kernel test robot <hidden> -
STALE1315d
Re: [PATCH v4 1/3] md: Move sb writer loop to its own function
2023-02-24 18:27 · 1 reply this month · kernel test robot <hidden> -
DORMANTno replies
Re: [PATCH for-next v2 4/4] RDMA/rxe: Add error messages
2023-02-24 17:09 · 0 replies this month · kernel test robot <hidden> -
STALE1304d
LANDED [PATCH v1 0/2] RISC-V: avoid build issues for clang/llvm-17 with binutils 2.35
2023-02-24 17:00 · 5 replies this month · Conor Dooley <conor@kernel.org> -
DORMANTno replies
❌ FAIL (104/381 SKIPPED): Test report for master (6.2.0, mainline.kernel.org-clang, f2b98d0a)
2023-02-24 16:20 · 0 replies this month · <hidden> -
DORMANTno replies
LANDED drivers/gpu/drm/omapdrm/omap_fbdev.c:235:6: warning: variable 'helper' is used uninitialized whenever 'if' condition is true
2023-02-24 16:16 · 0 replies this month · kernel test robot <hidden> -
DORMANTno replies
❌ FAIL (104/381 SKIPPED): Test report for master (6.2.0, mainline.kernel.org-clang, e4bc1588)
2023-02-24 16:01 · 0 replies this month · <hidden> -
STALE1287d
Re: [PATCH v8 1/3] riscv: Introduce CONFIG_RELOCATABLE
2023-02-24 15:59 · 1 reply this month · Alexandre Ghiti <alex@ghiti.fr> -
DORMANTno replies
[linux-next:master 7569/13939] error: unknown target CPU '8540'
2023-02-24 15:04 · 0 replies this month · kernel test robot <hidden> -
DORMANTno replies
❌ FAIL (104/381 SKIPPED): Test report for master (6.2.0, mainline.kernel.org-clang, fcc77d7c)
2023-02-24 15:02 · 0 replies this month · <hidden> -
DORMANTno replies
❌ FAIL (108/381 SKIPPED): Test report for master (6.2.0, mainline.kernel.org-clang, 0df82189)
2023-02-24 11:10 · 0 replies this month · <hidden>