llvm archive · January 2023
1,065 messages · showing the 100 most-recently-active threads .
-
STALE1340d
[syzbot] [ntfs3?] BUG: unable to handle kernel NULL pointer dereference in ntfs_sparse_cluster
2023-01-31 23:05 · 1 reply this month · syzbot <hidden> -
STALE1340d
Re: [PATCH v4 2/2] tools/resolve_btfids: Alter how HOSTCC is forced
2023-01-31 22:50 · 7 replies this month · Nathan Chancellor <nathan@kernel.org> -
DORMANTno replies
Re: [PATCH 2/2] clk: qcom: gpucc-sdm845: fix clk_dis_wait being programmed for CX GDSC
2023-01-31 22:34 · 0 replies this month · kernel test robot <hidden> -
DORMANTno replies
[jfern:sched/rt-throttle 2/3] kernel/sched/rt.c:1322:2: error: must use 'struct' tag to refer to type 'rt_rq'
2023-01-31 21:43 · 0 replies this month · kernel test robot <hidden> -
DORMANTno replies
❌ FAIL (25/383 SKIPPED): Test report for master (6.2.0-rc6, mainline.kernel.org-clang, 22b8077d)
2023-01-31 21:31 · 0 replies this month · <hidden> -
DORMANTno replies
[peterz-queue:core/softirq 8/8] kernel/rcu/tree_nocb.h:954:18: error: too few arguments to function call, expected 2, have 1
2023-01-31 19:50 · 0 replies this month · kernel test robot <hidden> -
STALE1340d
[lee-mfd:for-mfd-next 36/37] drivers/mmc/host/tmio_mmc.c:141:12: error: no member named 'enable' in 'struct mfd_cell'
2023-01-31 17:33 · 3 replies this month · kernel test robot <hidden> -
STALE1340d
[TCWG CI] Failure after llvmorg-16-init-18491-gde122cb92008: [SCCP] Use range info to prove AddInst has NUW flag.
2023-01-31 17:30 · 1 reply this month · <hidden> -
DORMANTno replies
[peterz-queue:sched/urgent 1/1] kernel/cgroup/cpuset.c:3749:1: error: expected 'while' in do/while loop
2023-01-31 17:26 · 0 replies this month · kernel test robot <hidden> -
DORMANTno replies
Re: [PATCH v2 3/3] mmc: sdhci-of-dwcmshc: Add host software queue support
2023-01-31 16:55 · 0 replies this month · kernel test robot <hidden> -
STALE1340d
LANDED [PATCH] kselftest/arm64: Remove redundant _start labels from zt-test
2023-01-31 16:30 · 1 reply this month · Mark Brown <broonie@kernel.org> -
STALE1340d
[PATCH v3 2/5] kbuild: deb-pkg: create source package without cleaning
2023-01-31 16:27 · 0 replies this month · Masahiro Yamada <masahiroy@kernel.org> -
STALE1340d
[syzbot] KASAN: out-of-bounds Read in ntfs_set_ea
2023-01-31 16:18 · 1 reply this month · syzbot <hidden> -
STALE1340d
drivers/platform/chrome/cros_ec_proto_test.c:2530:13: warning: stack frame size (1040) exceeds limit (1024) in 'cros_ec_proto_test_get_sensor_count_legacy'
2023-01-31 15:22 · 1 reply this month · kernel test robot <hidden> -
STALE1340d
REVIEWED: 19 (19M) [PATCH AUTOSEL 6.1 11/20] x86/build: Move '-mindirect-branch-cs-prefix' out of GCC-only block
2023-01-31 15:00 · 0 replies this month · Sasha Levin <sashal@kernel.org> -
STALE1340d
Re: [Intel-gfx] [PATCH v2] drm/i915/gt: Add sysfs RAPL PL1 interface
2023-01-31 13:08 · 0 replies this month · kernel test robot <hidden> -
DORMANTno replies
drivers/staging/media/deprecated/saa7146/common/saa7146_hlp.c:648:5: warning: stack frame size (1072) exceeds limit (1024) in 'saa7146_enable_overlay'
2023-01-31 11:55 · 0 replies this month · kernel test robot <hidden> -
DORMANTno replies
next/master build: 191 builds: 7 failed, 184 passed, 10 errors, 31 warnings (next-20230131)
2023-01-31 10:37 · 0 replies this month · kernelci.org bot <hidden> -
DORMANTno replies
[linux-stable-rc:linux-5.15.y 9007/9999] drivers/extcon/extcon-usbc-tusb320.c:19: warning: expecting prototype for drivers/extcon/extcon-tusb320.c(). Prototype was for TUSB320_REG8() instead
2023-01-31 10:02 · 0 replies this month · kernel test robot <hidden> -
STALE1340d
Re: [Intel-gfx] [PATCH v2] drm/i915/gt: Add sysfs RAPL PL1 interface
2023-01-31 09:21 · 0 replies this month · kernel test robot <hidden> -
STALE1341d
[PATCH v6 1/3] phy: mediatek: fix build warning caused by clang
2023-01-31 09:02 · 12 replies this month · Chunfeng Yun <chunfeng.yun@mediatek.com> -
STALE1339d
[6.1.7][6.2-rc5] perf all metrics test: FAILED!
2023-01-31 06:21 · 8 replies this month · Sedat Dilek <hidden> -
DORMANTno replies
[cxl:for-6.3/cxl-ram-region 17/17] ld.lld: error: undefined symbol: cxl_add_to_region
2023-01-31 05:07 · 0 replies this month · kernel test robot <hidden> -
DORMANTno replies
[peterz-queue:sched/core-staging 9/10] vmlinux.o: warning: objtool: local_clock+0x63: call to ftrace_likely_update() leaves .noinstr.text section
2023-01-31 03:04 · 0 replies this month · kernel test robot <hidden> -
DORMANTno replies
[peterz-queue:sched/core-staging 8/10] vmlinux.o: warning: objtool: native_sched_clock+0x7c: call to ftrace_likely_update() leaves .noinstr.text section
2023-01-31 01:01 · 0 replies this month · kernel test robot <hidden> -
STALE895d
[PATCH v4 0/3] objtool build improvements
2023-01-31 00:32 · 6 replies this month · Ian Rogers <irogers@google.com> -
STALE1341d
[PATCH] ARM: Allow pre-ARMv5 builds with ld.lld 16.0.0 and newer
2023-01-30 22:03 · 5 replies this month · Nathan Chancellor <nathan@kernel.org> -
STALE1341d
error: Undefined temporary symbol .LBB5_-1
2023-01-30 21:31 · 2 replies this month · kernel test robot <hidden> -
DORMANTno replies
Re: [PATCH 2/2] drm/tegra: add scanout support for implicit tiling parameters
2023-01-30 19:43 · 0 replies this month · kernel test robot <hidden> -
STALE1340d
Re: [PATCH v2 6/6] drm/debugfs: Make the struct drm_debugfs_entry independent of DRM device
2023-01-30 19:33 · 0 replies this month · kernel test robot <hidden> -
DORMANTno replies
Re: [Intel-gfx] [PATCH] drm/i915: Implement workaround for CDCLK PLL disable/enable
2023-01-30 19:12 · 0 replies this month · kernel test robot <hidden> -
DORMANTno replies
[linux-next:master 7468/9183] drivers/gpu/host1x/dev.c:520:6: warning: variable 'syncpt_irq' is uninitialized when used here
2023-01-30 19:02 · 0 replies this month · kernel test robot <hidden> -
DORMANTno replies
[linux-stable-rc:linux-5.4.y 5553/7257] arch/x86/entry/entry_64.o: warning: objtool: .entry.text+0x191: unsupported intra-function call
2023-01-30 18:21 · 0 replies this month · kernel test robot <hidden> -
DORMANTno replies
❌ FAIL (25/383 SKIPPED): Test report for master (6.2.0-rc6, mainline.kernel.org-clang, 6d796c50)
2023-01-30 17:11 · 0 replies this month · <hidden> -
STALE1332d
Re: [PATCH V8 5/6] arm64/perf: Add branch stack support in ARMV8 PMU
2023-01-30 16:29 · 0 replies this month · kernel test robot <hidden> -
STALE1341d
Re: [PATCH 4/4] DRM: BRIDGE: TFP410: If connected, use I2C for polled HPD status.
2023-01-30 16:24 · 1 reply this month · kernel test robot <hidden> -
DORMANTno replies
❌ FAIL (25/383 SKIPPED): Test report for master (6.2.0-rc5, mainline.kernel.org-clang, ab072681)
2023-01-30 15:21 · 0 replies this month · <hidden> -
STALE1338d
Re: [PATCH v3 06/11] usb: gadget: configfs: Support arbitrary string descriptors
2023-01-30 14:27 · 0 replies this month · kernel test robot <hidden> -
STALE1340d
Re: [PATCH v2 7/8] iommu: Retire bus ops
2023-01-30 14:25 · 1 reply this month · kernel test robot <hidden> -
DORMANTno replies
[madvenka786:orc_v3 19/22] ld.lld: error: assignment to symbol __init_end does not converge
2023-01-30 13:44 · 0 replies this month · kernel test robot <hidden> -
DORMANTno replies
Undelivered Mail Returned to Sender
2023-01-30 12:22 · 0 replies this month · Mail Delivery System <hidden> -
DORMANTno replies
next/master build: 195 builds: 12 failed, 183 passed, 20 errors, 32 warnings (next-20230130)
2023-01-30 07:39 · 0 replies this month · kernelci.org bot <hidden> -
DORMANTno replies
include/asm-generic/io.h:464:31: error: performing pointer arithmetic on a null pointer has undefined behavior
2023-01-30 05:25 · 0 replies this month · kernel test robot <hidden> -
STALE1342d
[akpm-mm:mm-unstable 167/506] include/linux/hugetlb.h:1193:9: error: implicit declaration of function 'page_count' is invalid in C99
2023-01-29 23:53 · 2 replies this month · kernel test robot <hidden> -
DORMANTno replies
[TCWG CI] Failure after v6.2-rc3-45-gbd904f3c7496: udf: Unify types in anchor block detection
2023-01-29 22:32 · 0 replies this month · <hidden> -
DORMANTno replies
[stable:linux-5.15.y 7114/9999] drivers/usb/host/isp1362.h:660:3: warning: performing pointer arithmetic on a null pointer has undefined behavior
2023-01-29 21:25 · 0 replies this month · kernel test robot <hidden> -
DORMANTno replies
[stable:linux-5.15.y 1982/9999] ld.lld: error: kernel/built-in.a(kallsyms.o):(function kallsyms_lookup_name: .text+0x58): relocation R_RISCV_PCREL_HI20 out of range: -524499 is not in [-524288, 524287]; references kallsyms_names
2023-01-29 20:13 · 0 replies this month · kernel test robot <hidden> -
STALE1340d
[PATCH v2 2/5] kbuild: deb-pkg: create source package without cleaning
2023-01-29 18:46 · 0 replies this month · Masahiro Yamada <masahiroy@kernel.org> -
DORMANTno replies
[qais-yousef:uclamp-spare-capacity-fixes 4/6] kernel/sched/fair.c:7459:11: error: unterminated function-like macro invocation
2023-01-29 18:30 · 0 replies this month · kernel test robot <hidden> -
DORMANTno replies
[qais-yousef:uclamp-spare-capacity-fixes 4/6] kernel/sched/fair.c:7460:28: warning: '&&' within '||'
2023-01-29 18:30 · 0 replies this month · kernel test robot <hidden> -
DORMANTno replies
[chao:dev-test 4/6] fs/f2fs/data.c:995:17: warning: implicit truncation from 'int' to a one-bit wide bit-field changes value from 1 to -1
2023-01-29 18:09 · 0 replies this month · kernel test robot <hidden> -
DORMANTno replies
Re: [PATCH] f2fs: reduce stack memory cost by using bitfield in struct f2fs_io_info
2023-01-29 16:26 · 0 replies this month · kernel test robot <hidden> -
DORMANTno replies
Re: [PATCH net-next v1] netlink: provide an ability to set default extack message
2023-01-29 15:45 · 0 replies this month · kernel test robot <hidden> -
STALE1342d
Re: [PATCH net-next v1] netlink: provide an ability to set default extack message
2023-01-29 15:45 · 0 replies this month · kernel test robot <hidden> -
DORMANTno replies
❌ FAIL (24/383 SKIPPED): Test report for master (6.2.0-rc5, mainline.kernel.org-clang, c9661827)
2023-01-29 15:21 · 0 replies this month · <hidden> -
STALE1343d
[TCWG CI] Failure after v6.2-rc1-1-gc476a78f19ef: ARM: remove CONFIG_UNUSED_BOARD_FILES
2023-01-29 09:41 · 1 reply this month · <hidden> -
STALE1343d
[PATCH 2/4] kbuild: deb-pkg: create source package without cleaning
2023-01-29 08:22 · 3 replies this month · Masahiro Yamada <masahiroy@kernel.org> -
STALE928d
Re: [RFC PATCH 08/14] arm64: Make the PHYS_MASK_SHIFT dynamic
2023-01-29 03:00 · 0 replies this month · kernel test robot <hidden> -
DORMANTno replies
[ammarfaizi2-block:paulmck/linux-rcu/peterz.2023.01.26a 67/68] vmlinux.o: warning: objtool: sched_clock+0x4: call to __SCT__pv_sched_clock() leaves .noinstr.text section
2023-01-29 01:48 · 0 replies this month · kernel test robot <hidden> -
STALE1298d
Re: [PATCH 1/3] KVM: Support sharing gpc locks
2023-01-29 00:47 · 0 replies this month · kernel test robot <hidden> -
STALE928d
Re: [RFC PATCH 05/28] arm64: RME: Define the user ABI
2023-01-29 00:47 · 0 replies this month · kernel test robot <hidden> -
STALE1330d
Re: [PATCH 30/57] media: atomisp: ov2680: Rework flip ctrls
2023-01-29 00:37 · 0 replies this month · kernel test robot <hidden> -
STALE1311d
Re: [RFC PATCH v2 1/2] PM: domains: Skip disabling unused domains if provider has sync_state
2023-01-28 21:53 · 0 replies this month · kernel test robot <hidden> -
STALE1342d
Re: [PATCH net v3 2/2] mlx5: fix possible ptp queue fifo use-after-free
2023-01-28 21:43 · 0 replies this month · kernel test robot <hidden> -
DORMANTno replies
❌ FAIL (25/383 SKIPPED): Test report for master (6.2.0-rc5, mainline.kernel.org-clang, 5af6ce70)
2023-01-28 21:30 · 0 replies this month · <hidden> -
DORMANTno replies
drivers/media/pci/sta2x11/sta2x11_vip.c:1053:6: warning: cast from 'irqreturn_t (*)(int, struct sta2x11_vip *)' (aka 'enum irqreturn (*)(int, struct sta2x11_vip *)') to 'irq_handler_t' (aka 'enum irqreturn (*)(int, void *)') converts to incompatible funct...
2023-01-28 20:52 · 0 replies this month · kernel test robot <hidden> -
DORMANTno replies
[linusw-gpio:gpiochip-no-driver-h 5/5] arch/arm/mach-omap1/irq.c:236:11: error: call to undeclared function 'irq_domain_add_legacy'; ISO C99 and later do not support implicit function declarations
2023-01-28 20:51 · 0 replies this month · kernel test robot <hidden> -
DORMANTno replies
Re: [PATCH net] xfrm: remove inherited bridge info from skb
2023-01-28 20:31 · 0 replies this month · kernel test robot <hidden> -
STALE1343d
Re: [PATCH 2/3] iommufd/device: Make hwpt_list list_add/del symmetric
2023-01-28 20:27 · 1 reply this month · kernel test robot <hidden> -
DORMANTno replies
Re: [PATCH 1/2] powerpc/64: Set default CPU in Kconfig
2023-01-28 20:20 · 0 replies this month · kernel test robot <hidden> -
DORMANTno replies
❌ FAIL (25/383 SKIPPED): Test report for master (6.2.0-rc5, mainline.kernel.org-clang, 90aaef4e)
2023-01-28 20:01 · 0 replies this month · <hidden> -
DORMANTno replies
[avpatel:riscv_sbi_nested_v1 35/52] arch/riscv/kvm/aia_aplic.c:264:6: warning: variable 'inject' is used uninitialized whenever 'if' condition is true
2023-01-28 19:49 · 0 replies this month · kernel test robot <hidden> -
STALE1286d
Re: [PATCH 03/31] ext4: Convert ext4_bio_write_page() to use a folio
2023-01-28 19:08 · 0 replies this month · kernel test robot <hidden> -
DORMANTno replies
Re: [PATCH v6 5/7] cdx: add cdx controller
2023-01-28 18:27 · 0 replies this month · kernel test robot <hidden> -
STALE1338d
LANDED [tip:x86/tdx 3/7] vmlinux.o: warning: objtool: __tdx_hypercall+0x7f: return with modified stack frame
2023-01-28 18:26 · 0 replies this month · kernel test robot <hidden> -
DORMANTno replies
❌ FAIL (29/383 SKIPPED): Test report for master (6.2.0-rc5, mainline.kernel.org-clang, e6f2f6ac)
2023-01-28 17:51 · 0 replies this month · <hidden> -
DORMANTno replies
❌ FAIL (25/383 SKIPPED): Test report for master (6.2.0-rc5, mainline.kernel.org-clang, 04ad927c)
2023-01-28 17:50 · 0 replies this month · <hidden> -
DORMANTno replies
net/mac80211/he.c:158:33: warning: taking address of packed member 'rx_mcs_80' of class or structure 'ieee80211_he_mcs_nss_supp' may result in an unaligned pointer value
2023-01-28 17:03 · 0 replies this month · kernel test robot <hidden> -
STALE1342d
Re: [PATCH net v3 2/2] mlx5: fix possible ptp queue fifo use-after-free
2023-01-28 16:43 · 0 replies this month · kernel test robot <hidden> -
DORMANTno replies
❌ FAIL (28/383 SKIPPED): Test report for master (6.2.0-rc5, mainline.kernel.org-clang, 83abd4d4)
2023-01-28 16:40 · 0 replies this month · <hidden> -
DORMANTno replies
[linusw-gpio:gpiochip-no-driver-h 5/5] arch/arm/mach-orion5x/board-rd88f5182.c:107:6: error: call to undeclared function 'of_machine_is_compatible'; ISO C99 and later do not support implicit function declarations
2023-01-28 16:32 · 0 replies this month · kernel test robot <hidden> -
STALE1340d
Re: [RFC PATCH v1 5/6] proc: Validate incoming allowlist
2023-01-28 16:32 · 0 replies this month · kernel test robot <hidden> -
STALE1343d
Re: [PATCH v7 1/1] ptrace,syscall_user_dispatch: checkpoint/restore support for SUD
2023-01-28 16:11 · 0 replies this month · kernel test robot <hidden> -
STALE1341d
Re: [PATCH v3] sched: Store restrict_cpus_allowed_ptr() call state
2023-01-28 15:20 · 0 replies this month · kernel test robot <hidden> -
DORMANTno replies
Re: [PATCH 6/7] drm/vmwgfx: Abstract placement selection
2023-01-28 15:09 · 0 replies this month · kernel test robot <hidden> -
STALE1337d
Re: [PATCH v6 12/14] KVM: s390: Extend MEM_OP ioctl by storage key checked cmpxchg
2023-01-28 14:38 · 0 replies this month · kernel test robot <hidden> -
STALE1337d
Re: [PATCH v6 12/14] KVM: s390: Extend MEM_OP ioctl by storage key checked cmpxchg
2023-01-28 14:38 · 0 replies this month · kernel test robot <hidden> -
STALE1343d
Re: [PATCH v8 bpf-next 2/5] bpf: Allow initializing dynptrs in kfuncs
2023-01-28 14:28 · 0 replies this month · kernel test robot <hidden> -
STALE1312d
Re: [PATCH v5 1/2] riscv: Get rid of riscv_pfn_base variable
2023-01-28 14:08 · 0 replies this month · kernel test robot <hidden> -
STALE1341d
Re: [PATCH v6 1/5] media: v4l2-core: Make the v4l2-core code enable/disable the privacy LED if present
2023-01-28 13:47 · 3 replies this month · kernel test robot <hidden> -
DORMANTno replies
Re: [PATCH v2] nl80211: Allow authentication frames and set keys on NAN interface
2023-01-28 13:16 · 0 replies this month · kernel test robot <hidden> -
STALE1343d
Re: [PATCH v2] nl80211: Allow authentication frames and set keys on NAN interface
2023-01-28 12:45 · 0 replies this month · kernel test robot <hidden> -
DORMANTno replies
❌ FAIL (29/383 SKIPPED): Test report for master (6.2.0-rc5, mainline.kernel.org-clang, 76e26e3c)
2023-01-28 12:40 · 0 replies this month · <hidden> -
DORMANTno replies
init/main.c:108:10: fatal error: 'asm/setup.h' file not found
2023-01-28 10:31 · 0 replies this month · kernel test robot <hidden> -
STALE1341d
Re: [PATCH v6 3/5] platform/x86: int3472/discrete: Create a LED class device for the privacy LED
2023-01-28 10:11 · 0 replies this month · kernel test robot <hidden> -
DORMANTno replies
[nbd168-wireless:mt76 35/36] drivers/net/wireless/mediatek/mt76/mac80211.c:1732:25: error: variable has incomplete type 'struct page_pool_stats'
2023-01-28 09:19 · 0 replies this month · kernel test robot <hidden> -
STALE1341d
Re: [PATCH bpf-next] Add support for tracing programs in BPF_PROG_RUN
2023-01-28 08:37 · 0 replies this month · kernel test robot <hidden> -
STALE1288d
[PATCH] gpu: host1x: fix uninitialized variable use
2023-01-28 08:12 · 2 replies this month · Arnd Bergmann <arnd@kernel.org> -
STALE1341d
Re: [PATCH] sched/fair: sanitize vruntime of entity being placed
2023-01-28 07:46 · 0 replies this month · kernel test robot <hidden> -
DORMANTno replies
[jack-fs:for_next 41/74] fs/udf/partition.c:86:28: warning: variable 'loc' is uninitialized when used here
2023-01-28 06:43 · 0 replies this month · kernel test robot <hidden>