llvm archive · August 2023
1,358 messages · showing the 100 most-recently-active threads .
-
STALE1127d
LANDED [PATCH] x86/audit: fix -Wmissing-variable-declarations warning for ia32_xyz_class
2023-08-31 23:18 · 2 replies this month · Justin Stitt <justinstitt@google.com> -
STALE1127d
LANDED truncation in drivers/video/fbdev/neofb.c
2023-08-31 22:27 · 5 replies this month · Nick Desaulniers <ndesaulniers@google.com> -
STALE1127d
[PATCH RFC] init: fix -Wmissing-variable-declarations warning
2023-08-31 21:19 · 1 reply this month · Justin Stitt <justinstitt@google.com> -
DORMANTno replies
vmlinux.o: warning: objtool: set_ftrace_ops_ro+0x27: relocation to !ENDBR: kexec_mark_crashkres+0x1e
2023-08-31 21:16 · 0 replies this month · kernel test robot <hidden> -
DORMANTno replies
❌ FAIL: Test report for master (6.5.0, mainline.kernel.org-clang, 87dfd85c)
2023-08-31 21:11 · 0 replies this month · <hidden> -
DORMANTno replies
[tip:x86/shstk 1/1] vmlinux.o: warning: objtool: do_user_addr_fault+0xa2c: unreachable instruction
2023-08-31 18:59 · 0 replies this month · kernel test robot <hidden> -
STALE1123d
Re: [v2] RISC-V: Add ptrace support for vectors
2023-08-31 18:24 · 4 replies this month · Nick Desaulniers <ndesaulniers@google.com> -
STALE1127d
RFC: blocking posts to the older mailing list
2023-08-31 17:45 · 2 replies this month · Nick Desaulniers <ndesaulniers@google.com> -
STALE1127d
REVIEWED: 1 (1M) Re: [PATCH] RISC-V: Remove unused "size" in ptrace
2023-08-31 17:20 · 0 replies this month · Nick Desaulniers <ndesaulniers@google.com> -
STALE1127d
Re: [PATCH v3 4/4] mm: memcg: use non-unified stats flushing for userspace reads
2023-08-31 16:40 · 1 reply this month · kernel test robot <hidden> -
DORMANTno replies
[PATCH] compiler.h: unify __UNIQUE_ID
2023-08-31 16:33 · 0 replies this month · Nick Desaulniers <ndesaulniers@google.com> -
DORMANTno replies
[robh:for-kernelci 7/7] drivers/soc/apple/mailbox.c:304:33: error: incomplete definition of type 'struct platform_device'
2023-08-31 14:44 · 0 replies this month · kernel test robot <hidden> -
DORMANTno replies
❌ FAIL (SKIPPED 5 of 271): Test report for master (6.5.0, mainline.kernel.org-clang, 4debf771)
2023-08-31 14:11 · 0 replies this month · <hidden> -
DORMANTno replies
[driver-core:debugfs_cleanup 7/7] fs/sysfs/file.c:397:8: warning: variable 'uid' is uninitialized when used here
2023-08-31 14:01 · 0 replies this month · kernel test robot <hidden> -
STALE1121d
Re: [PATCH] ptp: Demultiplexed timestamp channels
2023-08-31 13:30 · 0 replies this month · kernel test robot <hidden> -
DORMANTno replies
❌ FAIL (SKIPPED 5 of 271): Test report for master (6.5.0, mainline.kernel.org-clang, b97d64c7)
2023-08-31 13:01 · 0 replies this month · <hidden> -
DORMANTno replies
❌ FAIL (SKIPPED 5 of 271): Test report for master (6.5.0, mainline.kernel.org-clang, cd99b9eb)
2023-08-31 12:41 · 0 replies this month · <hidden> -
DORMANTno replies
[robh:for-kernelci 5/7] drivers/regulator/max8973-regulator.c:641:19: error: use of undeclared identifier 'id'
2023-08-31 09:57 · 0 replies this month · kernel test robot <hidden> -
DORMANTno replies
Re: [PATCH v6 3/3] thermal: thermal_core: Allow rebooting after critical temp
2023-08-31 09:36 · 0 replies this month · kernel test robot <hidden> -
DORMANTno replies
[robh:for-kernelci 6/7] sound/soc/samsung/smdk_wm8994.c:173:7: error: call to undeclared function 'of_match_device'; ISO C99 and later do not support implicit function declarations
2023-08-31 09:04 · 0 replies this month · kernel test robot <hidden> -
DORMANTno replies
❌ FAIL (SKIPPED 5 of 271): Test report for master (6.5.0, mainline.kernel.org-clang, ef2a0b7c)
2023-08-31 08:51 · 0 replies this month · <hidden> -
DORMANTno replies
next/master build: 114 builds: 0 failed, 114 passed, 9 warnings (next-20230831)
2023-08-31 07:18 · 0 replies this month · kernelci.org bot <hidden> -
DORMANTno replies
❌ FAIL (SKIPPED 20 of 271): Test report for master (6.5.0, mainline.kernel.org-clang, 4fb0dacb)
2023-08-31 07:03 · 0 replies this month · <hidden> -
DORMANTno replies
[robertosassu:ima-evm-lsms-v2-devel-v6 23/25] security/integrity/evm/evm_main.c:930:5: warning: no previous prototype for function 'evm_inode_init_security'
2023-08-31 05:40 · 0 replies this month · kernel test robot <hidden> -
STALE1128d
REVIEWED: 5 (5M) [PATCH v2] reapply: powerpc/xmon: Relax frame size for clang
2023-08-31 04:04 · 1 reply this month · Nick Desaulniers <ndesaulniers@google.com> -
DORMANTno replies
fs/namespace.c:3039: warning: Function parameter or member 'mp' not described in 'can_move_mount_beneath'
2023-08-31 03:45 · 0 replies this month · kernel test robot <hidden> -
DORMANTno replies
[robh:for-kernelci 5/7] drivers/char/tpm/tpm_i2c_nuvoton.c:549:25: error: incompatible pointer types passing 'struct device *' to parameter of type 'const struct i2c_client *'
2023-08-31 03:44 · 0 replies this month · kernel test robot <hidden> -
DORMANTno replies
❌ FAIL (SKIPPED 5 of 271): Test report for master (6.5.0, mainline.kernel.org-clang, 53ea7f62)
2023-08-31 03:41 · 0 replies this month · <hidden> -
DORMANTno replies
❌ FAIL (SKIPPED 5 of 271): Test report for master (6.5.0, mainline.kernel.org-clang, 1687d8ac)
2023-08-31 03:01 · 0 replies this month · <hidden> -
DORMANTno replies
❌ FAIL (SKIPPED 29 of 271): Test report for master (6.5.0, mainline.kernel.org-clang, 87245966)
2023-08-31 01:40 · 0 replies this month · <hidden> -
STALE1116d
Re: [PATCH v4 10/11] ASoC: SOF: Intel: Move binding to display driver outside of deferred probe
2023-08-31 00:00 · 0 replies this month · kernel test robot <hidden> -
STALE1128d
LANDED [PATCH] lib/Kconfig.debug: Restrict DEBUG_INFO_SPLIT for RISC-V
2023-08-30 23:44 · 8 replies this month · Nathan Chancellor <nathan@kernel.org> -
DORMANTno replies
[legion:sysctl-next 1/5] fs/proc/proc_sysctl.c:599:29: error: incompatible pointer types passing 'struct file *' to parameter of type 'struct file *'
2023-08-30 23:27 · 0 replies this month · kernel test robot <hidden> -
DORMANTno replies
[legion:sysctl-next 5/5] kernel/ucount.c:66:2: error: incompatible function pointer types initializing 'int (*)(struct inode *, struct file *)' with an expression of type 'int (struct inode *, struct file *)'
2023-08-30 23:07 · 0 replies this month · kernel test robot <hidden> -
DORMANTno replies
[robertosassu:ima-evm-lsms-v2-devel-v6 21/25] security/integrity/ima/ima_main.c:541:5: warning: no previous prototype for function 'ima_file_check'
2023-08-30 22:57 · 0 replies this month · kernel test robot <hidden> -
DORMANTno replies
ld.lld: error: vmlinux.a(arch/hexagon/kernel/head.o):(.init.text+0xd4): relocation R_HEX_B22_PCREL out of range: 2110640 is not in [-2097152, 2097151]; references '__vmnewmap'
2023-08-30 22:05 · 0 replies this month · kernel test robot <hidden> -
DORMANTno replies
[asahilinux:bits/090-spi-hid 15/21] drivers/hid/dockchannel-hid/dockchannel-hid.c:989:18: warning: format specifies type 'long' but the argument has type 'unsigned int'
2023-08-30 21:45 · 0 replies this month · kernel test robot <hidden> -
DORMANTno replies
[legion:sysctl-next 3/5] ipc/ipc_sysctl.c:25:28: error: incomplete definition of type 'struct file'
2023-08-30 21:25 · 0 replies this month · kernel test robot <hidden> -
DORMANTno replies
arch/x86/kernel/cpu/mtrr/generic.c:259: warning: Function parameter or member 'var' not described in 'mtrr_overwrite_state'
2023-08-30 20:33 · 0 replies this month · kernel test robot <hidden> -
STALE1128d
[PATCH] init: fix -Wmissing-variable-declarations clang warning
2023-08-30 20:23 · 1 reply this month · Justin Stitt <justinstitt@google.com> -
DORMANTno replies
[legion:sysctl-next 1/5] kernel/bpf/cgroup.c:1686: warning: Function parameter or member 'file' not described in '__cgroup_bpf_run_filter_sysctl'
2023-08-30 20:11 · 0 replies this month · kernel test robot <hidden> -
STALE1101d
LANDED [PATCH] soc: renesas: rmobile-sysc: fix -Wvoid-pointer-to-enum-cast warning
2023-08-30 19:31 · 1 reply this month · Justin Stitt <justinstitt@google.com> -
STALE1128d
[PATCH] efi: fix -Wmissing-variable-declarations warning
2023-08-30 19:31 · 3 replies this month · Justin Stitt <justinstitt@google.com> -
DORMANTno replies
Re: [RESEND PATCH] regulator: userspace-consumer: Retrieve supplies from DT
2023-08-30 19:17 · 0 replies this month · kernel test robot <hidden> -
DORMANTno replies
[PATCH v2] efi: fix -Wmissing-variable-declarations warning
2023-08-30 19:16 · 2 replies this month · Justin Stitt <justinstitt@google.com> -
DORMANTno replies
kernel/fork.c:1962: warning: bad line:
2023-08-30 18:45 · 0 replies this month · kernel test robot <hidden> -
STALE1128d
Apply 9451c79bc39e610882bdd12370f01af5004a3c4f to linux-5.4.y
2023-08-30 18:44 · 1 reply this month · Nathan Chancellor <nathan@kernel.org> -
STALE1094d
Re: [PATCH 8/8] counter: stm32-timer-cnt: add support for events
2023-08-30 18:38 · 0 replies this month · kernel test robot <hidden> -
STALE1128d
LANDED [PATCH v2 0/6] riscv: KCFI support
2023-08-30 18:36 · 1 reply this month · Sami Tolvanen <samitolvanen@google.com> -
DORMANTno replies
Fwd: [Announcement] Clang-Built Linux Meetup 2023: CFP
2023-08-30 18:32 · 0 replies this month · Bill Wendling <morbo@google.com> -
DORMANTno replies
[jcmvbkbc-xtensa:xtensa-6.5-esp32 24/34] clang-14: error: linker command failed with exit code 1 (use -v to see invocation)
2023-08-30 18:23 · 0 replies this month · kernel test robot <hidden> -
STALE1128d
[linux-next:master 3581/12910] arch/powerpc/kvm/../../../virt/kvm/vfio.c:89:7: error: attribute declaration must precede definition
2023-08-30 17:19 · 5 replies this month · kernel test robot <hidden> -
DORMANTno replies
[dhowells-fs:ceph-iter 34/36] fs/ceph/file.c:1775:9: error: use of undeclared identifier 'pages'
2023-08-30 16:52 · 0 replies this month · kernel test robot <hidden> -
DORMANTno replies
❌ FAIL (SKIPPED 14 of 271): Test report for master (6.5.0, mainline.kernel.org-clang, 6c1b980a)
2023-08-30 11:11 · 0 replies this month · <hidden> -
DORMANTno replies
[dhowells-fs:ceph-iter 34/36] fs/ceph/file.c:1093:47: warning: variable 'pages' is uninitialized when used here
2023-08-30 10:14 · 0 replies this month · kernel test robot <hidden> -
DORMANTno replies
[dhowells-fs:ceph-iter 32/36] fs/ceph/addr.c:255:36: error: no member named 'length' in 'struct ceph_osd_data'
2023-08-30 08:12 · 0 replies this month · kernel test robot <hidden> -
DORMANTno replies
❌ FAIL (SKIPPED 7 of 271): Test report for master (6.5.0, mainline.kernel.org-clang, d68b4b6f)
2023-08-30 07:10 · 0 replies this month · <hidden> -
DORMANTno replies
clang-14: error: unsupported option '-fsanitize=thread' for target 'powerpc-unknown-linux-gnu'
2023-08-30 07:09 · 0 replies this month · kernel test robot <hidden> -
DORMANTno replies
❌ FAIL (SKIPPED 6 of 271): Test report for master (6.5.0, mainline.kernel.org-clang, 651a00bc)
2023-08-30 06:51 · 0 replies this month · <hidden> -
DORMANTno replies
[bvanassche:block-for-next 18/18] drivers/scsi/scsi_error.c:2215:29: error: use of undeclared identifier 'cmd'; did you mean 'scmd'?
2023-08-30 06:46 · 0 replies this month · kernel test robot <hidden> -
DORMANTno replies
❌ FAIL (SKIPPED 7 of 271): Test report for master (6.5.0, mainline.kernel.org-clang, eaf9f464)
2023-08-30 06:20 · 0 replies this month · <hidden> -
DORMANTno replies
❌ FAIL (SKIPPED 14 of 271): Test report for master (6.5.0, mainline.kernel.org-clang, b96a3e91)
2023-08-30 05:51 · 0 replies this month · <hidden> -
DORMANTno replies
❌ FAIL (SKIPPED 14 of 271): Test report for master (6.5.0, mainline.kernel.org-clang, bd6c11bc)
2023-08-30 05:22 · 0 replies this month · <hidden> -
DORMANTno replies
next/master build: 176 builds: 3 failed, 173 passed, 4 errors, 12 warnings (next-20230830)
2023-08-30 05:16 · 0 replies this month · kernelci.org bot <hidden> -
DORMANTno replies
❌ FAIL (SKIPPED 17 of 271): Test report for master (6.5.0, mainline.kernel.org-clang, f97e18a3)
2023-08-30 04:12 · 0 replies this month · <hidden> -
DORMANTno replies
[dhowells-fs:ceph-iter 20/36] drivers/block/rbd.c:2741:3: warning: needs fixing
2023-08-30 03:45 · 0 replies this month · kernel test robot <hidden> -
DORMANTno replies
drivers/mmc/host/atmel-mci.c:238: warning: Function parameter or member 'dma_filter' not described in 'mci_platform_data'
2023-08-30 03:04 · 0 replies this month · kernel test robot <hidden> -
STALE1129d
[linuxppc:next-test 85/129] arch/powerpc/xmon/xmon.c:489:12: error: stack frame size (2160) exceeds limit (2048) in 'xmon_core'
2023-08-29 23:29 · 4 replies this month · kernel test robot <hidden> -
DORMANTno replies
[brauner-vfs:b4/vfs-super-mtd 51/51] ERROR: modpost: "sget_dev" [drivers/mtd/mtd.ko] undefined!
2023-08-29 23:24 · 0 replies this month · kernel test robot <hidden> -
DORMANTno replies
[linux-next:master 11990/13297] drivers/platform/x86/mlx-platform.c:6204:8: error: call to undeclared function 'pci_request_region'; ISO C99 and later do not support implicit function declarations
2023-08-29 22:32 · 0 replies this month · kernel test robot <hidden> -
DORMANTno replies
[brauner-vfs:b4/vfs-super-mtd 51/51] ld.lld: error: undefined symbol: sget_dev
2023-08-29 22:10 · 0 replies this month · kernel test robot <hidden> -
DORMANTno replies
arch/x86/kvm/kvm-amd.o: warning: objtool: __svm_sev_es_vcpu_run+0x4a: BP used as a scratch register
2023-08-29 20:50 · 0 replies this month · kernel test robot <hidden> -
DORMANTno replies
[brauner-vfs:b4/vfs-super-mtd 51/51] ld.lld: error: undefined symbol: sget_dev
2023-08-29 19:33 · 0 replies this month · kernel test robot <hidden> -
STALE1129d
[PATCH 0/2] scsi: fix 2 cases of -Wfortify-source
2023-08-29 18:49 · 5 replies this month · Nick Desaulniers <ndesaulniers@google.com> -
STALE1129d
Re: [PATCH v2 1/1] ALSA: control: Use list_for_each_entry_safe()
2023-08-29 17:51 · 0 replies this month · kernel test robot <hidden> -
STALE1128d
Re: [PATCH V4 4/7] cpufreq: Add a notification message that the highest perf has changed
2023-08-29 16:34 · 0 replies this month · kernel test robot <hidden> -
STALE1127d
Re: [PATCH 1/1] s390/dasd: fix string length handling
2023-08-29 15:44 · 4 replies this month · Nick Desaulniers <ndesaulniers@google.com> -
STALE1127d
REVIEWED: 1 (1M) Re: [PATCH 1/1] s390/dasd: fix string length handling
2023-08-29 15:42 · 3 replies this month · Nick Desaulniers <ndesaulniers@google.com> -
DORMANTno replies
[linux-next:master 12683/13297] drivers/scsi/qla2xxx/qla_nvme.c:1183:13: warning: unused variable 'fcport'
2023-08-29 15:26 · 0 replies this month · kernel test robot <hidden> -
STALE1129d
Re: [PATCH] [RFC] xfs: reduce AGF hold times during fstrim operations
2023-08-29 15:05 · 0 replies this month · kernel test robot <hidden> -
STALE1128d
Re: [PATCH V4 3/7] cpufreq: amd-pstate: Enable AMD Pstate Preferred Core Supporting.
2023-08-29 14:53 · 0 replies this month · kernel test robot <hidden> -
DORMANTno replies
drivers/net/ethernet/8390/axnet_cs.c:639:5: warning: performing pointer arithmetic on a null pointer has undefined behavior
2023-08-29 14:01 · 0 replies this month · kernel test robot <hidden> -
STALE1130d
[PATCH] modpost: Skip .llvm.call-graph-profile section check
2023-08-29 13:19 · 15 replies this month · Denis Nikitin <hidden> -
DORMANTno replies
❌ FAIL (SKIPPED 14 of 267): Test report for master (6.5.0, mainline.kernel.org-clang, 36534782)
2023-08-29 12:11 · 0 replies this month · <hidden> -
DORMANTno replies
❌ FAIL (SKIPPED 16 of 267): Test report for master (6.5.0, mainline.kernel.org-clang, 1c59d383)
2023-08-29 12:01 · 0 replies this month · <hidden> -
STALE1130d
[linux-next:master 1647/12910] arch/powerpc/include/asm/switch_to.h:86:2: error: call to __compiletime_assert_261 declared with 'error' attribute: BUILD_BUG failed
2023-08-29 11:48 · 2 replies this month · kernel test robot <hidden> -
STALE1098d
[PATCH v3 0/5] fix debug info for asm and DEBUG_INFO_SPLIT
2023-08-29 11:29 · 1 reply this month · Nick Desaulniers <ndesaulniers@google.com> -
DORMANTno replies
REVIEWED: 1 (0M) ✅ PASS (SKIPPED 15 of 267): Test report for master (6.5.0, mainline.kernel.org-clang, 6383cb42)
2023-08-29 10:21 · 0 replies this month · <hidden> -
DORMANTno replies
[gfs2:for-later 27/30] kernel/kthread.c:738: warning: Function parameter or member 'k' not described in 'kthread_stop_put'
2023-08-29 10:19 · 0 replies this month · kernel test robot <hidden> -
DORMANTno replies
❌ FAIL (SKIPPED 22 of 267): Test report for master (6.5.0, mainline.kernel.org-clang, 97efd283)
2023-08-29 10:10 · 0 replies this month · <hidden> -
DORMANTno replies
next/master build: 182 builds: 6 failed, 176 passed, 7 errors, 15 warnings (next-20230829)
2023-08-29 09:02 · 0 replies this month · kernelci.org bot <hidden> -
DORMANTno replies
[weiny2:dcd-v2-2023-08-28 24/36] drivers/cxl/core/hdm.c:431:31: warning: format specifies type 'unsigned long long' but the argument has type 'resource_size_t' (aka 'unsigned int')
2023-08-29 08:55 · 0 replies this month · kernel test robot <hidden> -
DORMANTno replies
REVIEWED: 1 (0M) ✅ PASS (SKIPPED 15 of 267): Test report for master (6.5.0, mainline.kernel.org-clang, 42a7f6e3)
2023-08-29 08:51 · 0 replies this month · <hidden> -
DORMANTno replies
[linux-next:master 10262/13297] vmlinux.o: warning: objtool: set_ftrace_ops_ro+0x33: relocation to !ENDBR: machine_kexec+0x152
2023-08-29 08:45 · 0 replies this month · kernel test robot <hidden> -
DORMANTno replies
[weiny2:dcd-v2-2023-08-28 29/36] drivers/dax/dax-private.h:129:16: error: field has incomplete type 'struct range'
2023-08-29 08:44 · 0 replies this month · kernel test robot <hidden> -
DORMANTno replies
❌ FAIL (SKIPPED 13 of 267): Test report for master (6.5.0, mainline.kernel.org-clang, 6f49693a)
2023-08-29 07:21 · 0 replies this month · <hidden> -
DORMANTno replies
❌ FAIL (SKIPPED 14 of 267): Test report for master (6.5.0, mainline.kernel.org-clang, 727dbda1)
2023-08-29 07:01 · 0 replies this month · <hidden> -
STALE1130d
arch/x86/kernel/cpu/amd.c:1289:6: warning: no previous prototype for function 'amd_check_microcode'
2023-08-29 05:33 · 2 replies this month · kernel test robot <hidden> -
DORMANTno replies
[qais-yousef:rt-thermal-pressure 1/2] kernel/sched/rt.c:2650:27: error: no member named 'cpu' in 'struct rq'
2023-08-29 03:57 · 0 replies this month · kernel test robot <hidden> -
STALE1128d
Re: [PATCH 10/12] hugetlb: batch PMD split for bulk vmemmap dedup
2023-08-29 03:48 · 3 replies this month · kernel test robot <hidden>