llvm archive · October 2021
972 messages · showing the 100 most-recently-active threads .
-
STALE1772d
[PATCH v5 00/15] x86: Add support for Clang CFI
2021-10-31 23:36 · 92 replies this month · Sami Tolvanen <samitolvanen@google.com> -
STALE1786d
[rostedt-trace:for-next 58/100] samples/ftrace/ftrace-direct-multi.c:8:6: warning: no previous prototype for function 'my_direct_func'
2021-10-31 21:46 · 0 replies this month · kernel test robot <hidden> -
DORMANTno replies
[jic23-iio:iio-iwyu-cleanups 37/75] drivers/iio/buffer/industrialio-buffer-cb.c:5:10: fatal error: 'linux/bitopsh' file not found
2021-10-31 19:45 · 0 replies this month · kernel test robot <hidden> -
STALE1787d
[PATCH] KVM: x86: Shove vp_bitmap handling down into sparse_set_to_vcpu_mask()
2021-10-31 19:06 · 6 replies this month · Sean Christopherson <seanjc@google.com> -
DORMANTno replies
Re: [PATCH v8 1/8] dax: Use percpu rwsem for dax_{read,write}_lock()
2021-10-31 18:16 · 0 replies this month · kernel test robot <hidden> -
STALE1780d
Re: [PATCH v2 12/12] watchdog: s3c2410: Add Exynos850 support
2021-10-31 15:15 · 0 replies this month · kernel test robot <hidden> -
DORMANTno replies
Re: [PATCH RFC] ALSA: control: Use xarray for faster lookups
2021-10-31 14:17 · 0 replies this month · kernel test robot <hidden> -
DORMANTno replies
Re: [PATCH v4] i2c: qcom-geni: Add support for GPI DMA
2021-10-31 14:06 · 0 replies this month · kernel test robot <hidden> -
STALE1786d
[Intel-wired-lan] [PATCH net v1] iavf: Fix handling of vlan strip virtual channel messages
2021-10-31 13:19 · 0 replies this month · kernel test robot <hidden> -
STALE1787d
[PATCH] kbuild: Support clang-$ver builds
2021-10-31 12:38 · 12 replies this month · Peter Zijlstra <peterz@infradead.org> -
STALE1786d
Re: [PATCH] iwlwifi: pcie: fix constant-conversion warning
2021-10-31 07:06 · 0 replies this month · Kalle Valo <hidden> -
DORMANTno replies
Re: [PATCH mptcp net-next v2] Support for IP_TOS for MPTCP setsockopt()
2021-10-31 03:55 · 0 replies this month · kernel test robot <hidden> -
DORMANTno replies
Re: [PATCH v2] kdb: Adopt scheduler's task clasification
2021-10-31 03:50 · 0 replies this month · kernel test robot <hidden> -
DORMANTno replies
[dhowells-fs:fscache-rewrite-indexing-3 51/55] fs/cifs/cifsfs.c:401:42: error: too many arguments to function call, expected single argument 'inode', have 2 arguments
2021-10-31 03:33 · 0 replies this month · kernel test robot <hidden> -
DORMANTno replies
net/mac80211/he.c:158:33: warning: taking address of packed member 'rx_mcs_80' of class or structure 'ieee80211_he_mcs_nss_supp' may result in an unaligned pointer value
2021-10-31 03:26 · 0 replies this month · kernel test robot <hidden> -
DORMANTno replies
[arnd-playground:randconfig-5.16-next 51/151] arch/x86/include/asm/ftrace.h:7:3: error: Compiler does not support fentry?
2021-10-31 01:33 · 0 replies this month · kernel test robot <hidden> -
DORMANTno replies
Re: [PATCH 1/4] dma-buf: add dma_fence_describe and dma_resv_describe
2021-10-30 23:23 · 0 replies this month · kernel test robot <hidden> -
DORMANTno replies
[axboe-block:for-5.16/block 136/175] kernel/sched/core.c:6346:23: error: no member named 'plug' in 'struct task_struct'
2021-10-30 19:48 · 0 replies this month · kernel test robot <hidden> -
STALE1780d
Re: [PATCH RFC bpf-next v1 4/6] bpf: Add reference tracking support to kfunc returned PTR_TO_BTF_ID
2021-10-30 18:28 · 0 replies this month · kernel test robot <hidden> -
STALE1788d
[sudeep-holla:v5.15/pcc_type3 15/16] drivers/acpi/pcc_opregion.c:30:2: error: implicit declaration of function 'acpi_ut_status_exit'
2021-10-30 13:04 · 1 reply this month · kernel test robot <hidden> -
STALE1786d
Re: [Intel-gfx] [PATCH v4 2/4] drm/i915: Update error capture code to avoid using the current vma state
2021-10-30 12:57 · 0 replies this month · kernel test robot <hidden> -
STALE1787d
[PATCH v4] media: rc: pwm-ir-tx: Switch to atomic PWM API
2021-10-30 09:22 · 11 replies this month · Maíra Canal <hidden> -
DORMANTno replies
[bluetooth-next:master 4/24] net/bluetooth/hci_sync.c:1333:5: warning: no previous prototype for function 'hci_scan_disable_sync'
2021-10-30 07:06 · 0 replies this month · kernel test robot <hidden> -
DORMANTno replies
Re: [RESEND PATCH v3 1/6] drm/ingenic: Simplify code by using hwdescs array
2021-10-30 06:07 · 0 replies this month · kernel test robot <hidden> -
DORMANTno replies
[chao:dev-test 8/9] fs/f2fs/extent_cache.c:370:7: error: implicit declaration of function 'f2fs_may_extent_tree'
2021-10-30 04:02 · 0 replies this month · kernel test robot <hidden> -
DORMANTno replies
[linux-next:master 8026/12841] arch/arm64/kvm/hyp/nvhe/sys_regs.c:478: warning: This comment starts with '/**', but isn't a kernel-doc comment. Refer Documentation/doc-guide/kernel-doc.rst
2021-10-30 03:54 · 0 replies this month · kernel test robot <hidden> -
DORMANTno replies
Re: [PATCH 2/3] drm/bridge: parade-ps8640: Move real poweroff action to new function
2021-10-30 00:55 · 0 replies this month · kernel test robot <hidden> -
DORMANTno replies
Re: [PATCH v1 1/2] arm64: kprobes: implement optprobes
2021-10-30 00:26 · 0 replies this month · kernel test robot <hidden> -
DORMANTno replies
[linux-next:master 6161/12841] arch/arm64/kvm/hyp/nvhe/switch.c:196: warning: expecting prototype for Handler for protected floating(). Prototype was for kvm_handle_pvm_fpsimd() instead
2021-10-30 00:05 · 0 replies this month · kernel test robot <hidden> -
DORMANTno replies
[linux-next:master 12285/12841] drivers/net/wireless/intel/iwlwifi/pcie/drv.c:1344:42: warning: implicit conversion from 'unsigned long' to 'int' changes value from 18446744073709551615 to -1
2021-10-29 23:17 · 0 replies this month · kernel test robot <hidden> -
STALE1784d
[PATCH] selftests: kselftest.h: mark functions with 'noreturn'
2021-10-29 22:23 · 3 replies this month · Anders Roxell <hidden> -
STALE1786d
[linux-next:master 11496/12841] ld.lld: error: undefined symbol: led_mc_calc_color_components
2021-10-29 21:02 · 0 replies this month · kernel test robot <hidden> -
DORMANTno replies
[linux-next:master 6154/12841] arch/arm64/kvm/hyp/nvhe/switch.c:163:26: warning: initializer overrides prior initialization of this subobject
2021-10-29 21:00 · 0 replies this month · kernel test robot <hidden> -
STALE1788d
Re: [PATCH 2/3] drm/bridge: parade-ps8640: Move real poweroff action to new function
2021-10-29 20:39 · 0 replies this month · kernel test robot <hidden> -
STALE1789d
Re: [RFC PATCH] Bluetooth: vhci: Add new packet type for VHCI
2021-10-29 18:23 · 0 replies this month · kernel test robot <hidden> -
DORMANTno replies
[PATCH] iwlwifi: pcie: fix constant-conversion warning
2021-10-29 15:43 · 0 replies this month · Arnd Bergmann <arnd@kernel.org> -
DORMANTno replies
[linux-next:master 12486/12841] drivers/gpu/drm/amd/amdgpu/../display/dc/dce/dmub_psr.c:231: warning: This comment starts with '/**', but isn't a kernel-doc comment. Refer Documentation/doc-guide/kernel-doc.rst
2021-10-29 13:17 · 0 replies this month · kernel test robot <hidden> -
DORMANTno replies
next/master build: 228 builds: 46 failed, 182 passed, 493 errors, 236 warnings (next-20211029)
2021-10-29 12:55 · 0 replies this month · kernelci.org bot <hidden> -
DORMANTno replies
Re: [PATCH] samples: fanotify: add CC_CAN_LINK dependency
2021-10-29 12:44 · 0 replies this month · Gabriel Krisman Bertazi <hidden> -
DORMANTno replies
[PATCH] samples: fanotify: add CC_CAN_LINK dependency
2021-10-29 11:34 · 0 replies this month · Arnd Bergmann <arnd@kernel.org> -
STALE1778d
Re: [PATCH v8, 06/17] media: mtk-vcodec: Manage multi hardware information
2021-10-29 11:03 · 0 replies this month · kernel test robot <hidden> -
DORMANTno replies
kernel/irq/msi.c:535:54: error: no member named 'maskbit' in 'struct msi_desc::(unnamed at include/linux/msi.h:147:4)'
2021-10-29 09:46 · 0 replies this month · kernel test robot <hidden> -
STALE1789d
Re: [PATCH 1/3] block: bio-integrity: add PI iovec to bio
2021-10-29 08:41 · 0 replies this month · kernel test robot <hidden> -
DORMANTno replies
[osandov:btrfs-send-encoded 9/14] fs/btrfs/ioctl.c:4959:15: warning: Assigned value is garbage or undefined [clang-analyzer-core.uninitialized.Assign]
2021-10-29 07:17 · 0 replies this month · kernel test robot <hidden> -
DORMANTno replies
❌ FAIL: Test report for kernel 5.15.0-rc7 (mainline.kernel.org-clang, f31531e5)
2021-10-29 05:02 · 0 replies this month · CKI Project <hidden> -
DORMANTno replies
❌ FAIL: Test report for kernel 5.15.0-rc7 (mainline.kernel.org-clang, 411a44c2)
2021-10-29 03:49 · 0 replies this month · CKI Project <hidden> -
DORMANTno replies
[rdma:wip/jgg-for-next 89/95] ld.lld: error: duplicate symbol: ib_umem_dmabuf_get_pinned
2021-10-29 03:34 · 0 replies this month · kernel test robot <hidden> -
DORMANTno replies
Re: [PATCH] Staging: greybus: audio_codec: changed a void function to return 0
2021-10-29 02:10 · 0 replies this month · kernel test robot <hidden> -
DORMANTno replies
Re: [PATCH v2] ACPI: platform_profile: Add support for notification chains
2021-10-29 00:59 · 0 replies this month · kernel test robot <hidden> -
DORMANTno replies
[rdma:wip/jgg-for-next 89/95] include/rdma/ib_umem.h:187:24: warning: no previous prototype for function 'ib_umem_dmabuf_get_pinned'
2021-10-29 00:53 · 0 replies this month · kernel test robot <hidden> -
STALE1779d
Re: [RFC 2/6] mm, thp: add a global interface for zero subapges reclaim
2021-10-29 00:44 · 0 replies this month · kernel test robot <hidden> -
STALE1789d
Re: [PATCH RFC] ALSA: control: Use xarray for faster lookups
2021-10-29 00:29 · 0 replies this month · kernel test robot <hidden> -
DORMANTno replies
[rmk-arm:cex7 98/98] drivers/bus/fsl-mc/fsl-mc-bus.c:167:44: error: no member named 'iommu_fwnode' in 'struct iommu_fwspec'
2021-10-29 00:12 · 0 replies this month · kernel test robot <hidden> -
DORMANTno replies
arch/arm/kernel/atags_proc.c:20:30: warning: unused variable 'atags_proc_ops'
2021-10-28 23:47 · 0 replies this month · kernel test robot <hidden> -
STALE1783d
LANDED [PATCH v2 1/2] tools: Bump minimum LLVM C++ std to GNU++14
2021-10-28 22:26 · 4 replies this month · Ian Rogers <irogers@google.com> -
DORMANTno replies
Re: [PATCH v5 6/7] kallsyms: add /proc/kallmodsyms
2021-10-28 21:52 · 0 replies this month · Nick Alcock <hidden> -
STALE1779d
Re: [RFC 1/6] mm, thp: introduce thp zero subpages reclaim
2021-10-28 20:50 · 0 replies this month · kernel test robot <hidden> -
DORMANTno replies
Re: [PATCH v4 1/2] drm/kmb: Enable ADV bridge after modeset
2021-10-28 20:19 · 0 replies this month · kernel test robot <hidden> -
DORMANTno replies
[linux-next:master 11855/12471] arch/riscv/net/bpf_jit_comp64.c:462:5: warning: no previous prototype for function 'rv_bpf_fixup_exception'
2021-10-28 20:08 · 1 reply this month · kernel test robot <hidden> -
DORMANTno replies
❌ FAIL: Test report for kernel 5.15.0-rc7 (mainline.kernel.org-clang, 1fc596a5)
2021-10-28 19:46 · 0 replies this month · CKI Project <hidden> -
DORMANTno replies
next/master build: 228 builds: 102 failed, 126 passed, 532 errors, 200 warnings (next-20211028)
2021-10-28 15:20 · 0 replies this month · kernelci.org bot <hidden> -
STALE1783d
Potentially Broken Address Dependency via test_bit() When Compiling With Clang
2021-10-28 14:34 · 7 replies this month · Paul Heidekrüger <hidden> -
DORMANTno replies
[frederic-dynticks:preempt/arm-v2 3/4] arch/arm64/kernel/entry-common.c:239:14: warning: no previous prototype for function 'arm64_preempt_schedule_irq'
2021-10-28 13:31 · 0 replies this month · kernel test robot <hidden> -
DORMANTno replies
Re: [PATCH net-next 2/3] mctp: Add flow extension to skb
2021-10-28 13:10 · 0 replies this month · kernel test robot <hidden> -
STALE1790d
LANDED [PATCH] ASoC: qdsp6: audioreach: Fix clang -Wimplicit-fallthrough
2021-10-28 12:59 · 1 reply this month · Nathan Chancellor <nathan@kernel.org> -
STALE1789d
Re: [PATCH] thermal: Fix implicit type conversion
2021-10-28 12:32 · 0 replies this month · kernel test robot <hidden> -
STALE1790d
Re: [PATCH net-next 3/3] mctp: Pass flow data & flow release events to drivers
2021-10-28 12:20 · 0 replies this month · kernel test robot <hidden> -
STALE1790d
Re: [PATCH net-next 2/3] mctp: Add flow extension to skb
2021-10-28 12:03 · 0 replies this month · kernel test robot <hidden> -
STALE1788d
Re: [PATCH v5 6/7] kallsyms: add /proc/kallmodsyms
2021-10-28 11:37 · 0 replies this month · kernel test robot <hidden> -
DORMANTno replies
[PATCH] media: atomisp: get rid of two unused functions
2021-10-28 09:25 · 0 replies this month · Mauro Carvalho Chehab <mchehab+huawei@kernel.org> -
STALE1787d
Re: [PATCH 2/3] virtio: cache indirect desc for packed
2021-10-28 07:38 · 0 replies this month · kernel test robot <hidden> -
STALE1790d
[PATCH v2] backlight: lp855x: Switch to atomic PWM API
2021-10-28 06:33 · 1 reply this month · Maíra Canal <hidden> -
STALE1789d
Re: [PATCH v3 2/2] crypto: mtk-eip93 - Add Mediatek EIP-93 crypto engine
2021-10-28 06:27 · 0 replies this month · kernel test robot <hidden> -
STALE1790d
Re: [PATCH v1 1/1] generic-radix-tree: Replace kernel.h with the necessary inclusions
2021-10-28 06:21 · 0 replies this month · kernel test robot <hidden> -
DORMANTno replies
[rmk-arm:zii 80/94] drivers/net/dsa/mv88e6xxx/serdes-6352.c:116:6: warning: variable 'err' is used uninitialized whenever 'if' condition is false
2021-10-28 06:12 · 0 replies this month · kernel test robot <hidden> -
STALE1790d
[PATCH net-next] net/mlx5: Add esw assignment back in mlx5e_tc_sample_unoffload()
2021-10-28 05:29 · 1 reply this month · Nathan Chancellor <nathan@kernel.org> -
DORMANTno replies
[sudeep-holla:ffa_notifications_proto 16/16] drivers/firmware/arm_ffa/test_driver_ffa.c:21:13: warning: redefinition of typedef 'ffa_partition_id_t' is a C11 feature
2021-10-28 05:05 · 0 replies this month · kernel test robot <hidden> -
STALE1751d
Re: [PATCH 2/4] mtd: spi-nor: add advanced protection and security features support
2021-10-28 04:44 · 0 replies this month · kernel test robot <hidden> -
STALE1790d
Re: [PATCH v1 1/1] delay: Replace kernel.h with the necessary inclusions
2021-10-28 02:37 · 0 replies this month · kernel test robot <hidden> -
DORMANTno replies
[hid:for-5.16/nintendo 20/20] drivers/hid/hid-nintendo.c:403:29: warning: unused variable 'JC_RUMBLE_ZERO_AMP_PKT_CNT'
2021-10-28 01:22 · 0 replies this month · kernel test robot <hidden> -
DORMANTno replies
[brauner:fs.binfmt 2/2] fs/binfmt_misc.c:86:37: error: no member named 'binfmt_misc' in 'struct user_namespace'
2021-10-28 00:30 · 0 replies this month · kernel test robot <hidden> -
STALE1787d
Re: [PATCH 2/3] virtio: cache indirect desc for packed
2021-10-28 00:29 · 0 replies this month · kernel test robot <hidden> -
DORMANTno replies
[hid:for-5.16/nintendo 9/20] drivers/hid/hid-nintendo.c:132:45: warning: unused variable 'joycon_rumble_frequencies'
2021-10-27 23:27 · 0 replies this month · kernel test robot <hidden> -
STALE1751d
Re: [PATCH 2/4] mtd: spi-nor: add advanced protection and security features support
2021-10-27 23:02 · 0 replies this month · kernel test robot <hidden> -
STALE1783d
Re: [PATCH v4 3/4] ACPI: APEI: Reserve the MCFG address for quirk ECAM implementation
2021-10-27 22:46 · 0 replies this month · kernel test robot <hidden> -
STALE1748d
Re: [RFC v16 8/9] iommu/smmuv3: report additional recoverable faults
2021-10-27 22:41 · 0 replies this month · kernel test robot <hidden> -
DORMANTno replies
[mlankhorst:topic/ttm-m2 16/36] drivers/gpu/drm/i915/gem/selftests/huge_pages.c:25:26: warning: no previous prototype for function 'hugepage_ctx'
2021-10-27 22:18 · 0 replies this month · kernel test robot <hidden> -
STALE1785d
Re: [PATCH v7 3/3] drm/bridge: ti-sn65dsi86: Implement the pwm_chip
2021-10-27 18:43 · 0 replies this month · kernel test robot <hidden> -
DORMANTno replies
[linux-next:master 9013/11937] ld.lld: error: undefined symbol: mt76_connac_mcu_reg_rr
2021-10-27 17:51 · 0 replies this month · kernel test robot <hidden> -
STALE1791d
Apply 091bb549f7722723b284f63ac665e2aedcf9dec9 to 4.19
2021-10-27 17:13 · 1 reply this month · Nathan Chancellor <nathan@kernel.org> -
DORMANTno replies
Re: [PATCH net-next 14/19] bnxt_en: extract coredump command line from current task
2021-10-27 16:57 · 0 replies this month · kernel test robot <hidden> -
STALE1791d
LANDED [PATCH] drm/msm/dpu: Remove commit and its uses in dpu_crtc_set_crc_source()
2021-10-27 16:07 · 1 reply this month · Nathan Chancellor <nathan@kernel.org> -
STALE1791d
Re: [PATCH net-next 14/19] bnxt_en: extract coredump command line from current task
2021-10-27 15:32 · 0 replies this month · kernel test robot <hidden> -
DORMANTno replies
[linux-next:master 9605/11937] arch/arm64/kvm/reset.c:49:20: error: implicit declaration of function 'sve_max_virtualisable_vl'
2021-10-27 15:23 · 0 replies this month · kernel test robot <hidden> -
DORMANTno replies
next/master build: 228 builds: 102 failed, 126 passed, 425 errors, 219 warnings (next-20211027)
2021-10-27 15:14 · 0 replies this month · kernelci.org bot <hidden> -
STALE1791d
Re: [PATCH net-next 03/19] bnxt_en: implement devlink dev reload driver_reinit
2021-10-27 14:59 · 0 replies this month · kernel test robot <hidden> -
STALE1790d
Re: [PATCHv2 bpf-next] kbuild: Unify options for BTF generation for vmlinux and modules
2021-10-27 13:44 · 0 replies this month · kernel test robot <hidden> -
DORMANTno replies
[linux-next:master 10147/11937] drivers/dma-buf/st-dma-resv.c:295:7: error: variable 'i' is used uninitialized whenever 'if' condition is true
2021-10-27 13:22 · 0 replies this month · kernel test robot <hidden> -
STALE1791d
Re: [PATCH v3] media: rc: pwm-ir-tx: Switch to atomic PWM API
2021-10-27 12:49 · 1 reply this month · Maíra Canal <hidden> -
DORMANTno replies
[linux-next:master 9945/11483] drivers/platform/x86/amd-pmc.c:428:30: error: use of undeclared identifier 'CONFIG_RTC_SYSTOHC_DEVICE'
2021-10-27 12:02 · 0 replies this month · kernel test robot <hidden>