Thread (2 messages) 2 messages, 2 authors, 2023-11-02

stable-rc: 5.15 - all builds failed - ld.lld: error: undefined symbol: kallsyms_on_each_symbol

From: Naresh Kamboju <hidden>
Date: 2023-11-01 15:25:17
Also in: stable

Hi Greg,

I see the following build warning / errors everywhere on stable-rc 5.15 branch.

ld.lld: error: undefined symbol: kallsyms_on_each_symbol
quoted
quoted
referenced by trace_kprobe.c
              trace/trace_kprobe.o:(create_local_trace_kprobe) in archive kernel/built-in.a
referenced by trace_kprobe.c
              trace/trace_kprobe.o:(__trace_kprobe_create) in archive kernel/built-in.a
make[1]: *** [Makefile:1227: vmlinux] Error 1

Links,
 - https://storage.tuxsuite.com/public/linaro/lkft/builds/2XXALLRIZaXJVcqhff4ZmGTeZoQ/

- Naresh
Keyboard shortcuts
hback out one level
jnext message in thread
kprevious message in thread
ldrill in
Escclose help / fold thread tree
?toggle this help