Thread (7 messages) 7 messages, 4 authors, 2011-03-18

Re: linux-next: build failure after merge of the final tree (block tree related)

flat view

From: Stephen Rothwell <hidden>
Date: 2011-03-16 23:31:46
Also in: lkml

Hi Jens,

On Fri, 11 Mar 2011 08:12:38 +0100 Jens Axboe [off-list ref] wrote:
On 2011-03-11 07:58, Stephen Rothwell wrote:
quoted
After merging the final tree, today's linux-next build (powerpc
allyesconfig) failed like this:

drivers/char/tpm/tpm_tis.c:96: warning: 'is_itpm' defined but not used
drivers/block/drbd/drbd_bitmap.c: In function '__bm_change_bits_to':
drivers/block/drbd/drbd_bitmap.c:1287: error: implicit declaration of function 'generic___test_and_set_le_bit'
drivers/block/drbd/drbd_bitmap.c:1289: error: implicit declaration of function 'generic___test_and_clear_le_bit'
drivers/block/drbd/drbd_bitmap.c: In function 'drbd_bm_test_bit':
drivers/block/drbd/drbd_bitmap.c:1438: error: implicit declaration of function 'generic_test_le_bit'

Caused by commit 4b0715f09655 ("drbd: allow petabyte storage on 64bit
arch").

I have applied this patch for today (surely there is a better way):
Thanks for not dropping it, I'll let the drbd guys send in a proper fix
and get it committed.
Ping?

-- 
Cheers,
Stephen Rothwell                    sfr@canb.auug.org.au
http://www.canb.auug.org.au/~sfr/

Attachments

Keyboard shortcuts
hback out one level
jnext message in thread
kprevious message in thread
ldrill in
Escclose help / fold thread tree
?toggle this help