# Re: 32bit x86 build broken (was: Re: \[GIT PULL\] Networking for 5.16-rc1)

- From: YueHaibing \<hidden\>
- Date: 2021-11-12 02:47:04 
- List: netdev
- Page: https://ratatoskr.run/netdev/2021/11/1570118
- Thread: https://ratatoskr.run/netdev/2021/11/1569746/t.md

```text
On 2021/11/12 9:46, Jakub Kicinski wrote:
> On Thu, 11 Nov 2021 23:09:07 +0000 pr-tracker-bot@kernel.org wrote:
>> The pull request you sent on Thu, 11 Nov 2021 08:33:01 -0800:
>>
>>> git://git.kernel.org/pub/scm/linux/kernel/git/netdev/net.git tags/net-5.16-rc1  
>>
>> has been merged into torvalds/linux.git:
>> https://git.kernel.org/torvalds/c/f54ca91fe6f25c2028f953ce82f19ca2ea0f07bb
> 
> Rafael, Srinivas, we're getting 32 bit build failures after pulling back
> from Linus today.
> 
> make[1]: *** [/home/nipa/net/Makefile:1850: drivers] Error 2
> make: *** [Makefile:219: __sub-make] Error 2
> ../drivers/thermal/intel/int340x_thermal/processor_thermal_mbox.c: In function ‘send_mbox_cmd’:
> ../drivers/thermal/intel/int340x_thermal/processor_thermal_mbox.c:79:37: error: implicit declaration of function ‘readq’; did you mean ‘readl’? [-Werror=implicit-function-declaration]
>    79 |                         *cmd_resp = readq((void __iomem *) (proc_priv->mmio_base + MBOX_OFFSET_DATA));
>       |                                     ^~~~~
>       |                                     readl
> 
> Is there an ETA on getting this fixed?

This is fixed by:
https://lore.kernel.org/lkml/a22a1eeb-c7a0-74c1-46e2-0a7bada73520@infradead.org/T/

> 
> 
> .
> 
```
