[5.19.0-next-20220811] Build failure drivers/vdpa

3 messages, 2 authors, 2022-08-11 · open the first message on its own page

[5.19.0-next-20220811] Build failure drivers/vdpa

From: Sachin Sant <hidden>
Date: 2022-08-11 10:06:44

5.19.0-next-20220811 linux-next fails to build on IBM Power with 
following error:

drivers/vdpa/vdpa_sim/vdpa_sim_blk.c: In function 'vdpasim_blk_handle_req':
drivers/vdpa/vdpa_sim/vdpa_sim_blk.c:201:3: error: a label can only be part of a statement and a declaration is not a statement
   struct virtio_blk_discard_write_zeroes range;
   ^~~~~~
drivers/vdpa/vdpa_sim/vdpa_sim_blk.c:202:3: error: expected expression before 'u32'
   u32 num_sectors, flags;
   ^~~
drivers/vdpa/vdpa_sim/vdpa_sim_blk.c:224:3: error: 'num_sectors' undeclared (first use in this function); did you mean 'bio_sectors'?
   num_sectors = vdpasim32_to_cpu(vdpasim, range.num_sectors);
   ^~~~~~~~~~~
   bio_sectors
drivers/vdpa/vdpa_sim/vdpa_sim_blk.c:224:3: note: each undeclared identifier is reported only once for each function it appears in
drivers/vdpa/vdpa_sim/vdpa_sim_blk.c:225:3: error: 'flags' undeclared (first use in this function); did you mean 'class'?
   flags = vdpasim32_to_cpu(vdpasim, range.flags);
   ^~~~~
   class
make[3]: *** [scripts/Makefile.build:250: drivers/vdpa/vdpa_sim/vdpa_sim_blk.o] Error 1
make[2]: *** [scripts/Makefile.build:525: drivers/vdpa/vdpa_sim] Error 2
make[1]: *** [scripts/Makefile.build:525: drivers/vdpa] Error 2
make[1]: *** Waiting for unfinished jobs….

Git bisect points to the following patch

commit d79b32c2e4a4e66d5678410cd45815c1c2375196
Date:   Wed Aug 10 11:43:47 2022 +0200
    vdpa_sim_blk: add support for discard and write-zeroes

Thanks
- Sachin

Re: [5.19.0-next-20220811] Build failure drivers/vdpa

From: Stefano Garzarella <sgarzare@redhat.com>
Date: 2022-08-11 10:15:25

On Thu, Aug 11, 2022 at 12:06 PM Sachin Sant [off-list ref] wrote:
5.19.0-next-20220811 linux-next fails to build on IBM Power with
following error:

drivers/vdpa/vdpa_sim/vdpa_sim_blk.c: In function 'vdpasim_blk_handle_req':
drivers/vdpa/vdpa_sim/vdpa_sim_blk.c:201:3: error: a label can only be part of a statement and a declaration is not a statement
   struct virtio_blk_discard_write_zeroes range;
   ^~~~~~
drivers/vdpa/vdpa_sim/vdpa_sim_blk.c:202:3: error: expected expression before 'u32'
   u32 num_sectors, flags;
   ^~~
drivers/vdpa/vdpa_sim/vdpa_sim_blk.c:224:3: error: 'num_sectors' undeclared (first use in this function); did you mean 'bio_sectors'?
   num_sectors = vdpasim32_to_cpu(vdpasim, range.num_sectors);
   ^~~~~~~~~~~
   bio_sectors
drivers/vdpa/vdpa_sim/vdpa_sim_blk.c:224:3: note: each undeclared identifier is reported only once for each function it appears in
drivers/vdpa/vdpa_sim/vdpa_sim_blk.c:225:3: error: 'flags' undeclared (first use in this function); did you mean 'class'?
   flags = vdpasim32_to_cpu(vdpasim, range.flags);
   ^~~~~
   class
make[3]: *** [scripts/Makefile.build:250: drivers/vdpa/vdpa_sim/vdpa_sim_blk.o] Error 1
make[2]: *** [scripts/Makefile.build:525: drivers/vdpa/vdpa_sim] Error 2
make[1]: *** [scripts/Makefile.build:525: drivers/vdpa] Error 2
make[1]: *** Waiting for unfinished jobs….

Git bisect points to the following patch

commit d79b32c2e4a4e66d5678410cd45815c1c2375196
Date:   Wed Aug 10 11:43:47 2022 +0200
    vdpa_sim_blk: add support for discard and write-zeroes
Thanks for the report, I already re-sent a new series with that patch fixed:
https://lore.kernel.org/virtualization/20220811083632.77525-1-sgarzare@redhat.com/T/#t

And it looks like it's already in Michael's tree:
https://git.kernel.org/pub/scm/linux/kernel/git/mst/vhost.git linux-next

Thanks,
Stefano

Re: [5.19.0-next-20220811] Build failure drivers/vdpa

From: Sachin Sant <hidden>
Date: 2022-08-11 11:44:48

On 11-Aug-2022, at 3:45 PM, Stefano Garzarella [off-list ref] wrote:
quoted
Date:   Wed Aug 10 11:43:47 2022 +0200
   vdpa_sim_blk: add support for discard and write-zeroes
Thanks for the report, I already re-sent a new series with that patch fixed:
https://lore.kernel.org/virtualization/20220811083632.77525-1-sgarzare@redhat.com/T/#t
Thanks. That patch works for me.

- Sachin
Keyboard shortcuts
hback out one level
jnext message in thread
kprevious message in thread
ldrill in
Escclose help / fold thread tree
?toggle this help