Compat-wireless release for 2010-09-18 is baked

From: Compat-wireless cronjob account <hidden>
Date: 2010-09-18 19:02:42

cat: /var/opt/compat/compat-wireless-2.6/compat_version: No such file or directory
cat: compat_base_tree: No such file or directory
cat: compat_base_tree_version: No such file or directory
cat: compat_version: No such file or directory
cat: /var/opt/compat/compat-wireless-2.6/compat_version: No such file or directory
scripts/Makefile.clean:17: /var/opt/compat/compat-wireless-2.6/drivers/net/wireless/ath/carl9170/Makefile: No such file or directory
make[5]: *** No rule to make target `/var/opt/compat/compat-wireless-2.6/drivers/net/wireless/ath/carl9170/Makefile'.  Stop.
make[4]: *** [/var/opt/compat/compat-wireless-2.6/drivers/net/wireless/ath/carl9170] Error 2
make[3]: *** [/var/opt/compat/compat-wireless-2.6/drivers/net/wireless/ath] Error 2
make[2]: *** [/var/opt/compat/compat-wireless-2.6/drivers/net/wireless] Error 2
make[1]: *** [_clean_/var/opt/compat/compat-wireless-2.6] Error 2
make: *** [clean] Error 2

compat-wireless code metrics

    706813 - Total upstream lines of code being pulled
Keyboard shortcuts
hback out one level
jnext message in thread
kprevious message in thread
ldrill in
Escclose help / fold thread tree
?toggle this help