[PATCH] Re: 2.6.0test4mm5 - compile problem (acpi)
DORMANTno replies
From: Catalin BOIE <hidden>
Date: 2003-09-04 04:39:47
Hi! (Please CC me. Thank you.) CC drivers/acpi/pci_link.o drivers/acpi/pci_link.c: In function `acpi_pci_link_try_get_current': drivers/acpi/pci_link.c:290: error: `_dbg' undeclared (first use in this function) drivers/acpi/pci_link.c:290: error: (Each undeclared identifier is reported only once drivers/acpi/pci_link.c:290: error: for each function it appears in.) make[2]: *** [drivers/acpi/pci_link.o] Error 1 make[1]: *** [drivers/acpi] Error 2 make: *** [drivers] Error 2 Patch: diff -ur acpi.ok/pci_link.c acpi/pci_link.c
--- acpi.ok/pci_link.c 2003-09-03 09:28:42.000000000 +0300
+++ acpi/pci_link.c 2003-09-03 13:42:28.000000000 +0300@@ -285,6 +285,8 @@ { int result; + ACPI_FUNCTION_TRACE("acpi_pci_link_try_get_current"); + result = acpi_pci_link_get_current(link); if (result && link->irq.active) { return_VALUE(result);
--- Catalin(ux) BOIE catab-m7amzYTWDwUM5Le54R2NVQ@public.gmane.org ------------------------------------------------------- This sf.net email is sponsored by:ThinkGeek Welcome to geek heaven. http://thinkgeek.com/sf